[OS X TeX] Xindy?

Peter Dyballa Peter_Dyballa at Web.DE
Sat Jul 8 12:02:28 EDT 2006

Am 08.07.2006 um 15:36 schrieb Simon Spiegel:

> ./minitests > minitests.out
> make[3]: *** [check] Error 132
> make[2]: *** [callback.h] Error 2
> make[1]: *** [xindy.run] Error 2
> make: *** [all-recursive] Error 1

For me compilation ends here:

	../../../ffcall/callback/trampoline_r/trampoline.c:354: error:  
‘vm_page_size’ undeclared (first use in this function)
	../../../ffcall/callback/trampoline_r/trampoline.c:354: error: (Each  
undeclared identifier is reported only once
	../../../ffcall/callback/trampoline_r/trampoline.c:354: error: for  
each function it appears in.)
	make[4]: *** [trampoline.lo] Error 1

Could be a ``-DNeXT´´ works around it ...

	configure: * checks for OS services
	checking for the valid characters in filenames... 7-bit

Obviously this software is not prepared for Mac OS X.

Mit friedvollen Grüßen


There is no national science just as there is no national  
multiplication table; what is national is no longer science.
                                       -- Anton Checov

------------------------- Info --------------------------
Mac-TeX Website: http://www.esm.psu.edu/mac-tex/
          & FAQ: http://latex.yauh.de/faq/
TeX FAQ: http://www.tex.ac.uk/faq
List Archive: http://tug.org/pipermail/macostex-archives/

More information about the MacOSX-TeX mailing list